allowing entering particles to enter+dcdt instead of oldporos

2 jobs for nathan_master_release in 6 minutes and 50 seconds (queued for 1 second)
Status Name Job ID Coverage
  Build
passed mfbuild #74009

00:00:47

 
  Test
failed mftests #74010

00:06:03

 
Name Stage Failure
failed
mftests Test
  File "/builds/fluidparticles/migflow/validation/cavity/cavity.py", line 117, in runTest
self.assertLess(E/N,vUp/10, "error is too large in Cavity")
AssertionError: 7.091143809241823 not less than 0.1 : error is too large in Cavity

----------------------------------------------------------------------
Ran 7 tests in 342.350s

FAILED (failures=2, errors=2)
ERROR: Job failed: exit code 1